پروتکل اوت‌وی‌-ریس
scope note: یک پروتکل احراز هویت شبکه های ناامن کامپیوتری
broader: پروتکل توزیع کلید
preferred label: Otwy-Ress protocol @en
type: Concept

پروتکل توزیع کلید
preferred label: key distribution protocol @en
type: Concept
narrower: پروتکل اوت‌وی‌-ریس