حمله خارجی
scope note: توسط یک کاربر غیر مجاز از محیط بیرونی آغاز می شود.
broader: حملات رمزنگاری
preferred label: external attack @en
type: Concept

حملات رمزنگاری
preferred label: cryptographic attacks @en
type: Concept
narrower: حمله خارجی