رمزنگاری
preferred label: cryptography @en
type: Concept
narrower: محرمانگی

محرمانگی
scope note: ارسال یا ذخیره اطلاعات به نحوی است که تنها افراد مجاز بتوانند از محتوای آن مطلع شوند که همان سرویس اصلی و اولیه پنهان کردن مفد پیام است.
broader: رمزنگاری
preferred label: confidentiality @en
type: Concept