توزیع آماری
preferred label: statistical distribution @en
type: Concept
narrower: توزیع مرکب

توزیع مرکب
scope note: توزیع فراوانی ای که از ترکیب دو یا چند توزیع جداگانه که نوع کلی آنها یکی است به دست می آید.
broader: توزیع آماری
preferred label: compound distribution @en
type: Concept