پیچیدگی فضایی
scope note: تعداد سلولهای حافظه مورد نیاز برای انجام محاسبات.
broader: نظریه پیچیدگی محاسباتی
preferred label: spatial complexity @en
type: Concept

نظریه پیچیدگی محاسباتی
preferred label: computational complexity theory @en
type: Concept
narrower: پیچیدگی فضایی