تکمیل شده گروه
scope note: در یک فضای یکنواخت هاسدورف، یک گروه توپولوژیک آبلی هاسدورف را می توان با یک گروه توپولوژیک هاسدورف کامل، تکمیل کرد به طوری که در گروه اول چگال باشد.
broader: ساختار یکنواخت
preferred label: completion of group @en
type: Concept

ساختار یکنواخت
preferred label: uniform structure @en
type: Concept
narrower: تکمیل شده گروه