خطای نوع اول
scope note: رد کردن فرض مورد آزمون به خطا وقتی که آن فرض درست است.
broader: نظریه آزمون فرض
preferred label: type I error @en
type: Concept

نظریه آزمون فرض
preferred label: theory of hypothesis testing @en
type: Concept
narrower: خطای نوع اول