نظریه آزمون فرض
preferred label: theory of hypothesis testing @en
type: Concept
narrower: خطای نوع دوم

خطای نوع دوم
scope note: پذیرش فرض مورد آزمون به خطا وقتی که فرض مقابل درست است.
broader: نظریه آزمون فرض
preferred label: type II error @en
type: Concept