ناحیه رد
preferred label: rejection region @en
type: Concept
narrower: مقدار بحرانی

مقدار بحرانی
scope note: مقدار بحرانی در ناحیه رد یک آزمون بر مبنای احتمالات مربوط به انواع خطاهای ممکن تعیین می گردد.
related: آماره آزمون
broader: ناحیه رد
preferred label: critical value @en
type: Concept

آماره آزمون
preferred label: testing statistic @en
type: Concept
related: مقدار بحرانی