تابع ضربه‌ای
scope note: تابعی ایده آلی یا تعمیم یافته که نه به وسیله مقادیرش بلکه بنا به رفتارش تحت عمل انتگرالگیری تعریف می شود.
related: تابع دلتا
broader: معادله دیفرانسیل جزئی
preferred label: impulse function @en
type: Concept

تابع دلتا
preferred label: delta function @en
type: Concept
related: تابع ضربه‌ای

معادله دیفرانسیل جزئی
preferred label: partial differential equation @en
type: Concept
narrower: تابع ضربه‌ای