همبستگی
preferred label: correlation @en
type: Concept
narrower: همبستگی منفی

همبستگی منفی
scope note: رابطه ای بین دو کمیت به نحوی که وقتی یکی از آن دو کاهش پیدا می کند دیگری افزایش پیدا می کند.
broader: همبستگی
preferred label: negative correlation @en
type: Concept