نظریه فلوکه
preferred label: Floquet theory @en
type: Concept
narrower: قضیه فلوکه

نمای فلوکه
preferred label: Floquet exponent @en
type: Concept
related: قضیه فلوکه

قضیه فلوکه
scope note: یک معادله دیفرانسیل خطی مرتبه دوم که ضریب هایش توابعی دوره ای و تک مقداری از یک متغیر مستقل اند، جوابی به شکل حاصل ضرب تابعی نمایی و تابع دوره ای دارد.
related: نمای فلوکه
broader: نظریه فلوکه
preferred label: Floquet theorem @en
type: Concept