معادله دیفرانسیل مرتبه اول ناکامل
preferred label: inexact first order differential equation @en
type: Concept
related: معادله دیفرانسیل مرتبه اول کامل

معادله دیفرانسیل مرتبه اول
preferred label: first order differential equation @en
type: Concept
narrower: معادله دیفرانسیل مرتبه اول کامل

معادله دیفرانسیل مرتبه اول کامل
scope note: یک معادله دیفرانسیل معمولی با متغیر ایکس و وای را کامل گویند هرگاه مشتق ضریب دیفرانسیل ایکس نسبت به وای برابر با مشتق ضریب دیفرانسیل وای نسبت به ایکس باشد
related: معادله دیفرانسیل مرتبه اول ناکامل
broader: معادله دیفرانسیل مرتبه اول
preferred label: exact first order differential equation @en
type: Concept