تابع لامه
preferred label: Lame function @en
type: Concept
narrower: تابع موج لامه

تابع موج لامه
alternative label: تابع موج بیضیواری
scope note: توابعی که وقتی معادله موج در مختصات بیضیواری تفکیک شود، پیش می آیند.
related: تابع موج
broader: تابع لامه
preferred label: Lame wave function @en
type: Concept

تابع موج
preferred label: wave function @en
type: Concept
related: تابع موج لامه