نوسانگر واهلش
scope note: نوسانگری است که در آن یک باطری به تدریج شارژ می شود و به سرعت شارژ خالی می کند.
related: نوسانگر وان در پول
broader: نوسانگر
preferred label: relaxation oscillator @en
type: Concept

نوسانگر وان در پول
preferred label: Van der Pol oscillator @en
type: Concept
related: نوسانگر واهلش

نوسانگر
preferred label: oscillator @en
type: Concept
narrower: نوسانگر واهلش