درستنمایی
scope note: درستنمایی نمونه ای از مقادیر مستقل، اگر f تابع احتمال باشد، برابر حاصل ضرب مقادیرf در هر متغیر مستقل است.
related: ترتیب درستنمایی
broader: برآورد ماکسیمم درستنمایی
preferred label: likelihood @en
type: Concept

ترتیب درستنمایی
preferred label: likelihood ratio order @en
type: Concept
related: درستنمایی

برآورد ماکسیمم درستنمایی
preferred label: maximum likelihood estimation @en
type: Concept
narrower: درستنمایی