اصل موضوع اجتماع
scope note: برای هر دسته دلخواه از مجموعه‌ها، مجموعه‌ای وجود دارد که شامل عناصری است که به حداقل یکی از مجموعه‌های دسته مفروض تعلق دارند.
broader: اصول موضوع نظریه مجموعه‌ها
preferred label: union axiom @en
type: Concept

اصول موضوع نظریه مجموعه‌ها
preferred label: axioms of set theory @en
type: Concept
narrower: اصل موضوع اجتماع