روش نیم‌متوسط‌ها
scope note: روشی برای برآورد سریع یک خط رگرسیون خطی که در آن داده ها به دو مجموعه برابر تقسیم می شوند.
broader: نظریه برآورد
preferred label: method of semi-averages @en
type: Concept

نظریه برآورد
preferred label: estimation theory @en
type: Concept
narrower: روش نیم‌متوسط‌ها