حالت بازگشتی
preferred label: recurrent state @en
type: Concept
narrower: حالت جاذب

حالت جاذب
scope note: مورد خاصی از حالت بازگشتی در یک فرایند مارکوف که در آن احتمال گذار برابر 1 است و وقتی فرایندی وارد حالت جاذب شود، هرگز از آن خارج نمی‌شود.
broader: حالت بازگشتی
preferred label: absorbing state @en
type: Concept