پیشامد
preferred label: event @en
type: Concept
narrower: پیشامدهای وابسته

پیشامدهای وابسته
scope note: دو پیشامد که وقوع یکی از آنها بر احتمال وقوع دیگری اثر بگذارد.
broader: پیشامد
preferred label: dependent events @en
type: Concept