قضیه آخر فرما
scope note: معادله x بتوان n+y بتوان n مساوی z بتوان n ، به ازای n بزرگتر از 3 جواب صحیح مثبت ندارد.
related: اندرو وایلز
broader: معادله دیوفانتی
preferred label: Fermat last theorem @en
type: Concept

اندرو وایلز
preferred label: Andrew Wiles @en
type: Concept
related: قضیه آخر فرما

معادله دیوفانتی
preferred label: Diophantine equation @en
type: Concept
narrower: قضیه آخر فرما