عدد صحیح خاص
preferred label: special integer @en
type: Concept
narrower: عدد ناقص

عدد ناقص
scope note: عدد صحیح مثبتی که مجموع مقسوم علیه هایش، از جمله 1 ولی بجز خودش، کوچکتر از خود عدد است.
broader: عدد صحیح خاص
preferred label: deficient number @en
type: Concept