ماتریس بازده
preferred label: payoff matrix @en
type: Concept
related: قاعده تصمیم بیز

راهبرد
preferred label: strategy @en
type: Concept
narrower: قاعده تصمیم بیز

قاعده تصمیم بیز
scope note: راهبرد انتخاب شده از میان چند راهبرد موجود، راهبردی است که بازده آن بیشترین مقدار مورد انتظار را دارد.
related: ماتریس بازده
broader: راهبرد
preferred label: Bayes decision rule @en
type: Concept