چرتکه دوپنجی
scope note: در یک قسمت 2 مهره و در قسمت دیگر 5 مهره وجود دارد.
broader: چرتکه
preferred label: biquinary abacus @en
type: Concept

چرتکه
preferred label: abacus @en
type: Concept
narrower: چرتکه دوپنجی