تابع ویژه
preferred label: eigen function @en
type: Concept
related: بسط تابع ویژه

نظریه کلاسیک عملگرهای خطی
preferred label: classic theory of linear operators @en
type: Concept
narrower: بسط تابع ویژه

بسط تابع ویژه
scope note: در نظریه طیفی عملگرهای خطی، گاهی عملگر با انتگرال یا سری ای شامل ویژه بردارهای آن برابر است، که این را بسط ویژه تابعی عملگر می نامند.
related: تابع ویژه
broader: نظریه کلاسیک عملگرهای خطی
preferred label: eigen function expansion @en
type: Concept