تار
preferred label: fiber @en
type: Concept
related: میدان باقیمانده

میدان باقیمانده
alternative label: هیات باقیمانده
scope note: حلقه خارج قسمتی یک حلقه موضعی نسبت به ایده آل ماکسیمالش.
related: تار
broader: میدان
preferred label: residue field @en
type: Concept

میدان
preferred label: field @en
type: Concept
narrower: میدان باقیمانده