تابع اندازه‌پذیر
preferred label: measurable function @en
type: Concept
related: تابع موضعا انتگرال‌پذیر

تابع آزمون
preferred label: test function @en
type: Concept
narrower: تابع موضعا انتگرال‌پذیر

تابع موضعا انتگرال‌پذیر
alternative label: تابع موضعی انتگرال پذیر
scope note: تابعی را روی یک مجموعه باز S در فضای اقلیدسی n بعدی موضعاً انتگرال پذیر می نامند، اگر تقریباً در هر نقطه S تعریف شود و انتگرالی متناهی روی زیرمجموعه های فشرده S داشته باشد.
related: تابع اندازه‌پذیر
broader: تابع آزمون
preferred label: locally integrable function @en
type: Concept