مخروط مستدیر مایل
scope note: مخروط مستدیر که محور آن عمود بر قاعده اش نیست.
broader: مخروط مستدیر
preferred label: oblique circular cone @en
type: Concept

مخروط مستدیر
preferred label: circular cone @en
type: Concept
narrower: مخروط مستدیر مایل