پشت‌هم گذاری
scope note: دنبال یافتن الگوریتمی برای کوچکترین چندضلعی محیط براشیا
related: مسئله np-سخت
broader: ترکیب‌بندی
preferred label: stacking @en
type: Concept

مسئله np-سخت
preferred label: nP-hard problem @en
type: Concept
related: پشت‌هم گذاری

ترکیب‌بندی
preferred label: composition @en
type: Concept
narrower: پشت‌هم گذاری