معادله دیفرانسیل هِلمهولتس
preferred label: Helmholtz differential equation @en
type: Concept
related: مختصات هم‌کانون

مختصات هم‌کانون
scope note: مختصات نقطه ای در صفحه با نرمی بزرگتر از 1 برحسب دستگاهی از بیضیها و هذلولیها که کانون هایشان در (1و0) و (1-و0) هستند.
related: معادله دیفرانسیل هِلمهولتس
broader: هندسه مختصاتی
preferred label: confocal coordinates @en
type: Concept

هندسه مختصاتی
preferred label: coordinate geometry @en
type: Concept
narrower: مختصات هم‌کانون