خم مشخصه
alternative label: منحنی مشخصه
scope note: هر یک از دو خم مزدوج در یک رویه با این ویژگی که امتدادهای مماس های گذرنده از هر نقطه خم، امتدادهای مشخصه رویه باشد.
related: امتدادهای مشخصه
broader: هندسه دیفرانسیل خم ها
preferred label: characteristic curve @en
type: Concept

امتدادهای مشخصه
preferred label: characteristic directions @en
type: Concept
related: خم مشخصه

هندسه دیفرانسیل خم ها
preferred label: differential geometry of curves @en
type: Concept
narrower: خم مشخصه