صفحه راستگر
scope note: صفحه ای که شامل مماس و قائم دوم بر خمی در یک نقطه مفروض از خم است.
related: طول کمان
broader: هندسه دیفرانسیل خم ها
preferred label: rectifying plane @en
type: Concept

طول کمان
preferred label: arc length @en
type: Concept
related: صفحه راستگر

هندسه دیفرانسیل خم ها
preferred label: differential geometry of curves @en
type: Concept
narrower: صفحه راستگر