دقت ساده
alternative label: دقت منفرد
scope note: دقت ساده هم ارز 6 تا 7 رقم اعشاری با معنی است.
broader: دقت ماشین
preferred label: single precision @en
type: Concept

دقت ماشین
preferred label: machine precision @en
type: Concept
narrower: دقت ساده