دقت منبسط
scope note: دقت وسعت یافته ممکن است هم ارز 19 تا 20 رقم با معنی باشد.
broader: دقت ماشین
preferred label: extended precision @en
type: Concept

دقت ماشین
preferred label: machine precision @en
type: Concept
narrower: دقت منبسط