اسپلاین درجه سه
alternative label: اسپلاین مکعبی
scope note: هر عضو گردایه‌ای از چندجمله‌ای‌های درجۀ سه که برای درون‌یابی تابعی به کار می‌رود.
related: تابع نیرو
broader: تابع اسپلاین درجه سه
preferred label: cubic spline @en
type: Concept

تابع نیرو
preferred label: forcing function @en
type: Concept
related: اسپلاین درجه سه

تابع اسپلاین درجه سه
preferred label: cubic spline function @en
type: Concept
narrower: اسپلاین درجه سه