فرایند اَدَمز-بشفرت
alternative label: روش آدمز-بشفرت
scope note: روشی برای انتگرال‌گیری عددی که در آن از فرمول‌های درونیابی گرگوری برای بسط تابع استفاده می‌شود.
related: معادله سفت
broader: روش چندمرحله‌ای
preferred label: Adams-Bashforth process @en
type: Concept

روش چندمرحله‌ای
preferred label: multistep method @en
type: Concept
narrower: فرایند اَدَمز-بشفرت

معادله سفت
preferred label: stiff equation @en
type: Concept
related: فرایند اَدَمز-بشفرت