ترکیبیات شمارشی
preferred label: enumerative combinatorics @en
type: Concept
narrower: مسئله زوج‌ها

مسئله زوج‌ها
alternative label: مساله ترتیب
scope note: مساله نشستن تعدادی مشخص زن و شوهر به دور یک میزگرد به طوری که دوجنس به تناوب کنار هم بنشینند و هیچ زن و شوهری کنار هم نباشند.
narrower: عدد زوج‌ها
broader: ترکیبیات شمارشی
preferred label: menage problem @en
type: Concept

عدد زوج‌ها
preferred label: menage number @en
type: Concept
broader: مسئله زوج‌ها