طرح بلوکی ناکامل متعادل تجزیه‌پذیر
scope note: یک طرح بلوکی ناکامل متعادل با این ویژگی که بلوک ها خودشان به r خانواده مرکب از v/k بلوک افراز می شوند، بطوری که هر عنصر دقیقا در یک بلوک از هر یک از این خانواده ها ظاهر می شود.
broader: طرح بلوکی ناکامل متعادل
preferred label: resolvable balanced incomplete block design @en
type: Concept

طرح بلوکی ناکامل متعادل
preferred label: balanced incomplete block design @en
type: Concept
narrower: طرح بلوکی ناکامل متعادل تجزیه‌پذیر