شبه‌درخت
scope note: هرگاه در گراف g راسی وجودداشته باشدکه بطوریکه g-x درخت باشد.
broader: درخت
preferred label: qausi-tree @en
type: Concept

درخت
preferred label: tree(graph) @en
type: Concept
narrower: شبه‌درخت