قضیه گراف تام
scope note: یک گراف تام است اگر و تنها اگر مولفه هایش تام باشند.
broader: گراف تام
preferred label: perfect graph theorem @en
type: Concept

گراف تام
preferred label: perfect graph @en
type: Concept
narrower: قضیه گراف تام