نظریه پرکولاسیون
preferred label: percolation theory @en
type: Concept
narrower: شبکه پرکولاسیون

رسانا
preferred label: conductor @en
type: Concept
related: شبکه پرکولاسیون

شبکه پرکولاسیون
scope note: مشبکه ای که از آمیزه های تصادفی از خطوط اتصال رسانا و نارسانا تشکیل یافته است.
related: رسانا
broader: نظریه پرکولاسیون
preferred label: percolation network @en
type: Concept