سیگما حلقه
alternative label: زیگما حلقه
scope note: حلقه ای از مجموعه ها که در آن هر اجتماع شمارایی از اعضا، خودش یک عضو است.
broader: نیم‌حلقه
preferred label: sigma ring @en
type: Concept

نیم‌حلقه
preferred label: semiring @en
type: Concept
narrower: سیگما حلقه