گراف کلبش
scope note: مجموعه همه زیرمجموعه های تعداد زوج یک مجموعه 5 عضوی. 16راس دارد.
broader: گراف قوی‌منتظم
preferred label: Clebsch graph @en
type: Concept

گراف قوی‌منتظم
preferred label: strongly regular graph @en
type: Concept
narrower: گراف کلبش