گراف گروهها
preferred label: graph of groups @en
type: Concept
narrower: گراف جانسون

گراف منتظم
preferred label: regular graph @en
type: Concept
related: گراف جانسون

گراف جانسون
scope note: گرافی که رئوس آن مجموعه همه زیرمجموعه های k عضوی از مجموعه n عضوی است و دوراس متصلند اگر اشتراک زیرمجموعه های متناظر آنها k-1 عضوی باشد.
related: گراف منتظم
broader: گراف گروهها
preferred label: Johnson graph @en
type: Concept