قضیه کوراتوفسکی
scope note: هر گراف مسطح است اگرو تنها اگر شامل زیرتقسیم گراف کامل 5 راسی یا گراف رفاهی نباشد.
related: قضیه تات
broader: گراف مسطح
preferred label: Kuratowski theorem @en
type: Concept

گراف مسطح
preferred label: planar graph @en
type: Concept
narrower: قضیه کوراتوفسکی

قضیه تات
preferred label: Tutte theorem @en
type: Concept
related: قضیه کوراتوفسکی