بستار گراف
scope note: با اضافه کردن یال به گراف اولیه تا جایی که مجموع درجات 2 راس نامتصل، حداقل تعداد رئوس گراف باشد.
broader: گراف همیلتنی
preferred label: closure of graph @en
type: Concept

گراف همیلتنی
preferred label: Hamiltonian graph @en
type: Concept
narrower: بستار گراف