قضیه باندی-کواتال
scope note: هر گراف ساده همیلتونی است اگر وفقط اگر بستار آن هامیلتونی باشد.
broader: گراف همیلتنی
preferred label: Bondy-Chvatal theorem @en
type: Concept

گراف همیلتنی
preferred label: Hamiltonian graph @en
type: Concept
narrower: قضیه باندی-کواتال