عمل گراف
preferred label: graph operation @en
type: Concept
narrower: گراف پل

گراف پل
scope note: دوتا گراف با اتصال یال از یک راس اولی به راسی از دومی تشکیل میشود.
broader: عمل گراف
preferred label: bridge graph @en
type: Concept