عمل گراف
preferred label: graph operation @en
type: Concept
narrower: گراف زنجیر

گراف زنجیر
scope note: از هر گراف یک راس با گراف بعدی یکی میشود و مجموعه گرافها به شکل زنجیر درمیاید.
broader: عمل گراف
preferred label: chain graph @en
type: Concept