نظریه تابع هندسی
preferred label: geometric function theory @en
type: Concept
narrower: اصل بازتابی شوارتس

اصل بازتابی شوارتس
alternative label: اصل تقارن شوارتس
scope note: اگر تابع مختلط f در ناحیه R ای که مرز آن شامل پاره ای از محور حقیقی است تحلیلی باشد، برای به دست آوردن ادامه تحلیلی تابع در ناحیه ای که قرینه R نسبت به این پاره خط است، تابع مزدوج مختلط f درنظر گرفته شود.
broader: نظریه تابع هندسی
preferred label: Schwarz reflection principle @en
type: Concept